{"text_format":"1","workbook":"xlsx","n_sheets":9,"sheets":["Cover page","Instructions","Summary","Tool","Products","List","Forms","Assumtpions and Data Source","Excercises"],"not_rendered":{"charts":1,"images":5,"macros":0,"external_links":14,"defined_names":71,"comments":1,"pivot_tables":0},"unopened":[],"bounds":{"document_bytes":16777216,"sheet_cells":100000,"rows_first":2000,"rows_last":500,"rows_between":2000,"halvings":0,"cell_chars":16384,"cell_head_chars":4096},"cells_cut":0,"cells_raw":0,"read":"whole","date_system":"1900"}

{"sheet":"Cover page","index":0,"n_rows":2,"n_cols":2,"rows_kept":2,"cut":false,"hidden":false,"merged":[]}
[]
[null,"Quantification Tool EID "]

{"sheet":"Instructions","index":1,"n_rows":34,"n_cols":8,"rows_kept":34,"cut":false,"hidden":false,"merged":[[8,1,15,4],[3,7,26,7]]}
[]
[null,"Instructions"]
[]
[null,null,null,null,null,null,null,"- Quantification Model -"]
[]
[]
[null,"Overview"]
[]
[null,"This tool is a Consumption-based and Target-based tool that allows you to run a 1 year forecast for EID products with quarterly projected needs. Projections can be either based on labs estimates of tests to be performed or on national targets, whenever consumption data are not available. This tool quantifies for the lab-related supplies (Reagents and non-reagent Consumables) and the site-related supplies (DBS collection materials).\nNote: It is important to work closely with all the lab managers of every EID lab in the country when completing this forecast.  Suggested default settings for some inputs are shown below in blue italicized text. Other notes are shown in grey italicized text"]
[]
[]
[]
[]
[]
[]
[]
[]
[null,"Instructions"]
[]
[null,null,"Input cells"]
[]
[]
[null,null,"Output cells"]
[]
[]
[null,null,"Calculation cell"]
[]
[null,"Important: Input products and pricing information on the product page (Yellow tab)"]
[]
[null,"Contacts"]
[]
[]
[null,"Paolo Maggiore (CHAI)","pmaggiore@clintonHealthAccess.org"]
[null,"Anisa Ghadrshenas (CHAI)","aghadrshenas@clintonHealthAccess.org"]

{"sheet":"Summary","index":2,"n_rows":43,"n_cols":8,"rows_kept":43,"cut":false,"hidden":false,"merged":[]}
[]
[]
[null,"EID Forecasting Summary"]
[]
[]
[]
[]
[null,"Forecasting - quarterly procurements"]
[]
[null,null,"1 year forecasting beginning in:",{"$f":"CONCATENATE(Tool!D9,\"  \",Tool!E9)","v":"  "}]
[]
[null,null,null,"Quarter 1","Quarter 2","Quarter 3","Quarter 4","Total"]
[]
[null,null,"Expected # Tests to be covered (including westage, controls, losses, buffer etc.)",{"$f":"Tool!D557+Tool!D558+Tool!D559","v":0},{"$f":"Tool!E557+Tool!E558+Tool!E559","v":0},{"$f":"Tool!F557+Tool!F558+Tool!F559","v":0},{"$f":"Tool!G557+Tool!G558+Tool!G559","v":0},{"$f":"SUM(D14:G14)","v":0}]
[]
[null,"Procurement Outputs - Volumes"]
[]
[null,null,null,{"$f":"Tool!D230","v":"Procurement for Consumption in 0 (0)"},{"$f":"Tool!E230","v":"Procurement for Consumption in 0 (0)"},{"$f":"Tool!F230","v":"Procurement for consumption in 0 (0)"},{"$f":"Tool!G230","v":"Procurement for Consumption in 0 (0)"},"Total Procurement"]
[]
[null,null,"DBS Bundles - 20 Test Kits",{"$f":"IF(Tool!D232=\"\",0,Tool!D232)","v":0},{"$f":"Tool!E232","v":0},{"$f":"Tool!F232","v":0},{"$f":"Tool!G232","v":0},{"$f":"SUM(D20:G20)","v":0}]
[null,null,"DBS Bundles - 50 Test Kits",{"$f":"Tool!D233","v":0},{"$f":"Tool!E233","v":0},{"$f":"Tool!F233","v":0},{"$f":"Tool!G233","v":0},0]
[null,null,"Amplicor Reagent Kits",{"$f":"Tool!D234","v":0},{"$f":"Tool!E234","v":0},{"$f":"Tool!F234","v":0},{"$f":"Tool!G234","v":0},{"$f":"SUM(D22:G22)","v":0}]
[null,null,"CAP/CTM Reagent Kits*",{"$f":"Tool!D235","v":0},{"$f":"Tool!E235","v":0},{"$f":"Tool!F235","v":0},{"$f":"Tool!G235","v":0},0]
[null,null,"m2000 Reagent Kits*",{"$f":"Tool!D236","v":0},{"$f":"Tool!E236","v":0},{"$f":"Tool!F236","v":0},{"$f":"Tool!G236","v":0},0]
[null,null,"Generic Lab Consumables Bundles Amplicor",{"$f":"Tool!D237","v":0},{"$f":"Tool!E237","v":0},{"$f":"Tool!F237","v":0},{"$f":"Tool!G237","v":0},0]
[null,null,"Generic Lab Consumables Bundles CAP/CTM",{"$f":"Tool!D238","v":0},{"$f":"Tool!E238","v":0},{"$f":"Tool!F238","v":0},{"$f":"Tool!G238","v":0},0]
[null,null,"Generic Lab Consumables Bundles Abbott",{"$f":"Tool!D239","v":0},{"$f":"Tool!E239","v":0},{"$f":"Tool!F239","v":0},{"$f":"Tool!G239","v":0},0]
[null,null,"* Reagents are bundled with proprietary lab consumables"]
[]
[null,"Procurement Outputs - Budget"]
[]
[null,null,null,{"$f":"Tool!D244","v":"Procurement for Consumption in 0 (0)"},{"$f":"Tool!E244","v":"Procurement for Consumption in 0 (0)"},{"$f":"Tool!F244","v":"Procurement for Consumption in 0 (0)"},{"$f":"Tool!G244","v":"Procurement for Consumption in 0 (0)"},"Total Procurement"]
[]
[null,null,"DBS Bundles - 20 Test Kits",{"$f":"Tool!D246","v":0},{"$f":"Tool!E246","v":0},{"$f":"Tool!F246","v":0},{"$f":"Tool!G246","v":0},{"$f":"SUM(D34:G34)","v":0}]
[null,null,"DBS Bundles - 50 Test Kits",{"$f":"Tool!D247","v":0},{"$f":"Tool!E247","v":0},{"$f":"Tool!F247","v":0},{"$f":"Tool!G247","v":0},0]
[null,null,"Amplicor Reagent Kits",{"$f":"Tool!D248","v":0},{"$f":"Tool!E248","v":0},{"$f":"Tool!F248","v":0},{"$f":"Tool!G248","v":0},0]
[null,null,"CAP/CTM Reagent Kits",{"$f":"Tool!D249","v":0},{"$f":"Tool!E249","v":0},{"$f":"Tool!F249","v":0},{"$f":"Tool!G249","v":0},0]
[null,null,"m2000 Reagent Kits",{"$f":"Tool!D250","v":0},{"$f":"Tool!E250","v":0},{"$f":"Tool!F250","v":0},{"$f":"Tool!G250","v":0},0]
[null,null,"Generic Lab Consumables Bundles Amplicor",{"$f":"Tool!D251","v":0},{"$f":"Tool!E251","v":0},{"$f":"Tool!F251","v":0},{"$f":"Tool!G251","v":0},0]
[null,null,"Generic Lab Consumables Bundles CAP/CTM",{"$f":"Tool!D252","v":0},{"$f":"Tool!E252","v":0},{"$f":"Tool!F252","v":0},{"$f":"Tool!G252","v":0},0]
[null,null,"Generic Lab Consumables Bundles Abbott",{"$f":"Tool!D253","v":0},{"$f":"Tool!E253","v":0},{"$f":"Tool!F253","v":0},{"$f":"Tool!G253","v":0},0]
[]
[null,null,"Total Cost",{"$f":"SUM(D34:D42)","v":0},{"$f":"SUM(E34:E42)","v":0},{"$f":"SUM(F34:F42)","v":0},{"$f":"SUM(G34:G42)","v":0},{"$f":"SUM(H34:H42)","v":0}]

{"sheet":"Tool","index":3,"n_rows":572,"n_cols":23,"rows_kept":572,"cut":false,"hidden":false,"merged":[[103,5,106,6],[329,7,334,8],[355,7,360,8],[5,6,5,7],[5,8,5,9],[273,7,278,8],[171,5,173,7],[213,5,215,7],[98,5,100,6],[137,5,138,6],[33,5,37,6],[169,5,169,7],[26,5,28,6],[16,5,17,6],[70,3,70,6]]}
[]
[null,"EID Forecasting Tool"]
[]
[null,"Input"]
[]
[]
[null,"General Program Information"]
[null,null,null,"Quarter","Year"]
[null,null,"This is a 1 Year Forecast that begins in:"]
[]
[null,null,"MTCT rate - Mother to Child transmission rate",null,null,"This figure is used to calculate the expected # of confirmatory tests."]
[]
[null,null,"Algorithm"]
[null,null,null,null,"with same sample?"]
[null,null,"HIV positive infants are tested again to confirm HIV positivity",null,null,"It is unlikely that confirmatory tests are conducted with a different sample."]
[]
[null,null,"HIV negative infants are tested again at the end of breastfeeding",null,null,"This refers to infants who are HIV-negative after the first PCR but are still exposed through breastfeeding."]
[]
[]
[null,null,"National Target next year"]
[]
[null,null,"% Target realistically achievable based on the latest information available"]
[]
[null,null,"Loss To Follow Up (LTFU)"]
[]
[null,null,"HEI infants lost between first and confirmatory test",null,null,"It is unlikely that this figure is available. If it is not, leave blank."]
[null,null,"HEI infants lost between first testing period and end of breastfeeding",null,null,"This refers to the total number of HEI who are LTFU. Gayle Sherman wrote a paper that says 88% of exposed infants are lost to follow up by 18 months."]
[]
[]
[null,null,"# of Expected EID Tests Per Year",{"$f":"$E$20*$D$22+IF($D$20=\"Target # HEI\",IF(AND($D$15=\"yes\",$E$15=\"Yes\"),($D$11)*$E$20*$D$22,IF(AND(D15=\"Yes\",E15=\"No\"),($D$11)*$E$20*$D$22*(1-$D$26)))+IF($D$17=\"Yes\",(1-$D$11)*$E$20*$D$22*(1-$D$27),0),0)","v":0}]
[null,null,"# of Expected EID Samples Per Year",{"$f":"IF($D$20=\"Target # HEI\",($E$20*$D$22+IF($D$17=\"Yes\",(1-$D$11)*$E$20*$D$22*(1-$D$27),0)+IF(AND($D$15=\"Yes\",E15=\"No\"),(1-$D$26)*$E$20*$D$22*$D$11,0)),IF(D20<>\"Target # HEI\",(IF(AND($D$15=\"Yes\",$E$15=\"Yes\"),E20*$D$22,0)+IF(AND($D$15=\"Yes\",$E$15=\"No\"),$E$20*$D$22+$D$11*$E$20*$D$22*(1-$D$27))),0)+IF($D$15=\"No\",E20*$D$22,0))","v":0}]
[]
[]
[null,"Data Available",null,null,null,"If there is no consumption data available, input the table below with the % of tests performed of the total on each platform (eg. Roche CAP/CTM 80%, Roche Amplicor 20%).\nIMPORTANT: The platforms should be named exactly as follows: Roche CAP/CTM, Roche Amplicor, Abbott m2000."]
[]
[null,null,"Consumption Data available?"]
[]
[]
[null,"Laboratories - General Information"]
[]
[null,null,"Lab Name","Testing Platform","weight over total # tests (%)"]
[]
[null,null,null,null,null,{"$f":"H75/$H$96","v":{"$error":"#DIV/0!"}}]
[null,null,null,null,null,{"$f":"H76/$H$96","v":{"$error":"#DIV/0!"}}]
[null,null,null,null,null,{"$error":"#DIV/0!"}]
[null,null,null,null,null,{"$error":"#DIV/0!"}]
[null,null,null,null,null,{"$error":"#DIV/0!"}]
[null,null,null,null,null,{"$error":"#DIV/0!"}]
[null,null,null,null,null,{"$error":"#DIV/0!"}]
[null,null,null,null,null,{"$error":"#DIV/0!"}]
[null,null,null,null,null,{"$error":"#DIV/0!"}]
[null,null,null,null,null,{"$error":"#DIV/0!"}]
[null,null,null,null,null,{"$error":"#DIV/0!"}]
[null,null,null,null,null,{"$error":"#DIV/0!"}]
[null,null,null,null,null,{"$error":"#DIV/0!"}]
[null,null,null,null,null,{"$error":"#DIV/0!"}]
[null,null,null,null,null,{"$error":"#DIV/0!"}]
[null,null,null,null,null,{"$error":"#DIV/0!"}]
[null,null,null,null,null,{"$error":"#DIV/0!"}]
[null,null,null,null,null,{"$error":"#DIV/0!"}]
[null,null,null,null,null,{"$error":"#DIV/0!"}]
[null,null,null,null,null,{"$error":"#DIV/0!"}]
[]
[]
[]
[]
[null,"Laboratories - Expected Testing During Forecast Period (# samples)"]
[]
[null,null,"Consumption Data available at the Lab",null,null,null,null,null,null,"Trend Line # Tests lst 4 quarters"]
[]
[null,null,null,"These are the last four quarters with available consumption data"]
[null,null,"Consumption Data"]
[null,null,"Lab Name",{"$f":"CONCATENATE(,$D$69,\" in \", E571,\" (\", E572,\")\")","v":" in 0 (0)"},{"$f":"CONCATENATE(,$D$69,\" in \", F571,\" (\", F572,\")\")","v":" in 0 (0)"},{"$f":"CONCATENATE(,$D$69,\" in \", G571,\" (\", G572,\")\")","v":" in 0 (0)"},{"$f":"CONCATENATE(,$D$69,\" in \", H571,\" (\", H572,\")\")","v":" in 0 (0)"},{"$f":"CONCATENATE(,\"Total \",$D$69,\"\")","v":"Total "}]
[]
[null,null,{"$f":"IF(ISBLANK($C43),\"\",CONCATENATE($C43,\" \",$D43))","v":""},null,null,null,null,{"$f":"SUM(D75:G75)","v":0}]
[null,null,"",null,null,null,null,0]
[null,null,"",null,null,null,null,0]
[null,null,"",null,null,null,null,0]
[null,null,"",null,null,null,null,0]
[null,null,"",null,null,null,null,0]
[null,null,"",null,null,null,null,0]
[null,null,"",null,null,null,null,0]
[null,null,"",null,null,null,null,0]
[null,null,"",null,null,null,null,0]
[null,null,"",null,null,null,null,0]
[null,null,"",null,null,null,null,0]
[null,null,"",null,null,null,null,0]
[null,null,"",null,null,null,null,0]
[null,null,"",null,null,null,null,0]
[null,null,"",null,null,null,null,0]
[null,null,"",null,null,null,null,0]
[null,null,"",null,null,null,null,0]
[null,null,"",null,null,null,null,0]
[null,null,"",null,null,null,null,0]
[]
[null,null,"TOTAL",{"$f":"SUM(D75:D94)","v":0},{"$f":"SUM(E75:E94)","v":0},{"$f":"SUM(F75:F94)","v":0},{"$f":"SUM(G75:G94)","v":0},{"$f":"SUM(H75:H94)","v":0}]
[]
[]
[null,null,null,null,null,"Data follows a 'trend' when there has not been high variability of testing volumes from a quarter to another in the last year (no alternate drops/increases)"]
[null,null,"Testing data follow a clear trend?"]
[]
[]
[null,null,"Scale up plan"]
[null,null,null,null,null,"The growth rate should reflect the interventions expected to be put in place to address the issues experienced in the previous quarters (eg. Machine downtimes, stock outs etc.) and/or increase capacity (eg. New staff, automation etc.)"]
[null,null,"Scale Up plan next year (% growth expected)"]
[]
[]
[]
[]
[]
[null,null,"Estimates (based on variability and trend line)"]
[null,null,"Lab Name",{"$f":"D73","v":" in 0 (0)"},{"$f":"E73","v":" in 0 (0)"},{"$f":"F73","v":" in 0 (0)"},{"$f":"G73","v":" in 0 (0)"},{"$f":"H73","v":"Total "}]
[]
[null,null,{"$f":"C75","v":""},{"$f":"IF($D$36=\"No\",$D$30/4*E43,(IF(ISBLANK(D75),\"\",MAX(G75+$E383+G75*($F301/4),$G75+STDEV($D75:$G75)))))","v":""},{"$f":"IF($D$36=\"No\",$D$30/4*$E43,IF(ISBLANK(E75),\"\",(D114+$E383+$G75*($F301/4))))","v":""},"","",{"$f":"SUM(D114:G114)","v":0}]
[null,null,"",{"$f":"IF($D$36=\"No\",$D$30/4*E44,((IF(ISBLANK(D76),\"\",MAX(G76+$E384+G76*($F302/4),$G76+STDEV($D76:$G76))))))","v":""},"","","",0]
[null,null,"","","","","",0]
[null,null,"","","","","",0]
[null,null,"","","","","",0]
[null,null,"","","","","",0]
[null,null,"","","","","",0]
[null,null,"","","","","",0]
[null,null,"","","","","",0]
[null,null,"","","","","",{"$f":"SUM(D123:G123)","v":0}]
[null,null,"","","","","",0]
[null,null,"","","","","",0]
[null,null,"","","","","",0]
[null,null,"","","","","",0]
[null,null,"","","","","",0]
[null,null,"","","","","",0]
[null,null,"","","","","",0]
[null,null,"","","","","",0]
[null,null,"","","","","",0]
[null,null,"","","","","",0]
[]
[null,null,"TOTAL",{"$f":"SUM(D114:D133)","v":0},{"$f":"SUM(E114:E133)","v":0},{"$f":"SUM(F114:F133)","v":0},{"$f":"SUM(G114:G133)","v":0},{"$f":"SUM(H114:H133)","v":0}]
[]
[]
[null,null,"National Target # of EID Tests Per Year",{"$f":"D30","v":0},null,"These two numbers should ideally be within 10% of each other"]
[null,null,"Estimated # of EID Tests Per Year",{"$f":"H351","v":0}]
[]
[]
[]
[null,"Laboratories - Westage and Controls"]
[]
[]
[null,null,"# Controls Used for Every 96 Tests","Sample Rejection Rate (%)","Tests used quarterly for training (%)"]
[]
[null,null,null,0.05,0.05]
[]
[]
[]
[null,null,"# Samples and # Tests including controls and wastage"]
[null,null,null,{"$f":"D467","v":"0 (0)"},{"$f":"E467","v":"0 (0)"},{"$f":"F467","v":"0 (0)"},{"$f":"G467","v":"0 (0)"},"TOTAL"]
[]
[null,null,"# Samples Collected (including wastage)",{"$f":"E491","v":0},{"$f":"F491","v":0},{"$f":"G491","v":0},{"$f":"H491","v":0},{"$f":"SUM(D155:G155)","v":0}]
[]
[null,null,"# Tests (including controls)"]
[null,null,"Roche Amplicor",{"$f":"D468","v":0},0,0,0,{"$f":"SUM(D158:G158)","v":0}]
[null,null,"Roche CAP/CTM",0,0,0,0,{"$f":"SUM(D159:G159)","v":0}]
[null,null,"Abbott m2000",0,0,0,0,{"$f":"SUM(D160:G160)","v":0}]
[null,null,"Total",{"$f":"SUM(D158:D160)","v":0},{"$f":"SUM(E158:E160)","v":0},{"$f":"SUM(F158:F160)","v":0},{"$f":"SUM(G158:G160)","v":0},{"$f":"SUM(H158:H160)","v":0}]
[]
[null,null,"Average Monthly Consumption - Samples",{"$f":"D155/3","v":0},{"$f":"E155/3","v":0},{"$f":"F155/3","v":0},{"$f":"G155/3","v":0}]
[null,null,"Average Monthly Consumption - Tests",{"$f":"D161/3","v":0},{"$f":"E161/3","v":0},{"$f":"F161/3","v":0},{"$f":"G161/3","v":0}]
[]
[]
[]
[null,"EID Sample Collection Sites"]
[]
[null,null,"Procurement of at least 1 pack of collection test kits per clinic?",null,null,"This is the recommended method of procurement."]
[]
[null,null,"Baseline # of EID Sample Collection Sites",null,null,"The # EID sites is considered as the minimum # of DBS kits to be procured, with the assumption that every EID site should receive at least 1 DBS sample collection kit."]
[]
[null,null,"Target # of EID Sample Collection Sites expected to be operative by next year"]
[]
[null,null,null,null,"Multiplier - 20 kits","Multiplier - 50 kits"]
[]
[null,null,"Collection sites that collect less than 20 samples per quarter"]
[]
[null,null,"Collection sites that collect between 20 and 40 samples per quarter",null,1,0]
[]
[null,null,"Collection sites that collect between 40 and 60 samples per quarter",null,2,0]
[]
[null,null,"Collection sites that collect more than 60 samples per quarter",null,3,1]
[null,null,null,{"$f":"SUM(D178:D184)","v":0},{"$f":"IF(AND(D185<>100%,D185<>0%),\"Error - Sum should be 100%\",\"\")","v":""}]
[]
[null,"Existing  Stock / Pipeline"]
[]
[null,null,"Data on Stock is available?","Yes",{"$f":"IF(AND(E201+E226<>0,D189=\"No\"),\"WARNING! Delete old data stock input in red\",\"\")","v":""}]
[]
[null,null,null,"Existing Stock (# units)","Stock in the Pipeline (# units)",{"$f":"CONCATENATE(\"Stock Expiring later than \", J571,\" (\", J572,\")\")","v":"Stock Expiring later than 0 (0)"}]
[]
[null,null,"DBS Bundles - 20 Test Kits",0,null,{"$f":"IF(F510-$D$203<1,0,ROUND((F510-$D$203)*$D$163/Products!D21,0))","v":{"$error":"#DIV/0!"}}]
[null,null,"DBS Bundles - 50 Test Kits",0,null,{"$f":"IF(F511-$D$203<1,0,ROUND((F511-$D$203)*$D$163/Products!D22,0))","v":{"$error":"#DIV/0!"}}]
[null,null,"Amplicor Reagent Kits 96",0,null,{"$f":"IF(F512-$D$203<1,0,ROUND((F512-$D$203)*$D$164/Products!D23,0))","v":{"$error":"#DIV/0!"}}]
[null,null,"CAP/CTM Reagent Kits 48",0,null,{"$f":"IF(F513-$D$203<1,0,ROUND((F513-$D$203)*$D$164/Products!D24,0))","v":{"$error":"#DIV/0!"}}]
[null,null,"m2000 Reagent Kits 96",0,null,{"$f":"IF(F514-$D$203<1,0,ROUND((F514-$D$203)*$D$164/Products!D25,0))","v":{"$error":"#DIV/0!"}}]
[null,null,"Generic Lab Consumables Bundles Amplicor",0,null,{"$f":"IF(F515-$D$203<1,0,ROUND((F515-$D$203)*$D$164/Products!D26,0))","v":{"$error":"#DIV/0!"}}]
[null,null,"Generic Lab Consumables Bundles CAP/CTM",0,null,{"$f":"IF(F516-$D$203<1,0,ROUND((F516-$D$203)*$D$164/Products!D27,0))","v":{"$error":"#DIV/0!"}}]
[null,null,"Generic Lab Consumables Bundles Abbott",0,null,{"$f":"IF(F517-$D$203<1,0,ROUND((F517-$D$203)*$D$164/Products!D28,0))","v":{"$error":"#DIV/0!"}}]
{"$rows_left_out":373}
{"sheet":"Products","index":4,"n_rows":28,"n_cols":7,"rows_kept":28,"cut":false,"hidden":false,"merged":[]}
[]
[null,"EID"]
[]
[]
[null,"Analyzers"]
[]
[null,null,"Platform","Testing Capacity (# tests per year)"]
[null,null,"Roche Amplicor",25000]
[null,null,"Roche CAP/CTM",50000]
[null,null,"Abbott m2000",50000]
[]
[]
[]
[]
[]
[null,"Products and Pricing"]
[]
[]
[null,null,"Item","Tests Per Pack","Cost per Pack","Cost per Test"]
[]
[null,null,"DBS Bundles - 20 Test Kits",20,{"$f":"F21*D21","v":36.17},1.8085,"This price is part of a global pricing deal with Lasec. The price is ex-works, so taxes, transportation, and distribution margin should be added to this cost if used for budgeting purposes."]
[null,null,"DBS Bundles - 50 Test Kits",50,71.56,1.4312,"This price is part of a global pricing deal with Lasec. The price is ex-works, so taxes, transportation, and distribution margin should be added to this cost if used for budgeting purposes."]
[null,null,"Amplicor Reagent Kits 96 + Consumables",96,0,null,"Use current pricing. If not available, use the price/ test from the global deal +/- 20%."]
[null,null,"CAP/CTM Reagent Kits 48 + Consumables",48,0,null,"Use current pricing. If not available, use the price/ test from the global deal +/- 20%."]
[null,null,"m2000 Reagent Kits 96 + Consumables",96,1200,12.5,"This price is part of a global pricing deal with Abbott. The price is ex-works, so taxes, transportation, and distribution margin should be added to this cost if used for budgeting purposes."]
[null,null,"Generic Lab Consumables Amplicor",960,1795.0000000003201,1.869791666667,"This price is part of a global pricing deal with LabMate. The price is ex-works, so taxes, transportation, and distribution margin should be added to this cost if used for budgeting purposes."]
[null,null,"Generic Lab Consumables CAP/CTM",960,315,0.328125,"This price is part of a global pricing deal with Lasec. The price is ex-works, so taxes, transportation, and distribution margin should be added to this cost if used for budgeting purposes."]
[null,null,"Generic Lab Consumables Abbott",960,965.6899999968,1.00592708333,"This price is part of a global pricing deal with Lasec. The price is ex-works, so taxes, transportation, and distribution margin should be added to this cost if used for budgeting purposes."]

{"sheet":"List","index":5,"n_rows":8,"n_cols":2,"rows_kept":8,"cut":false,"hidden":true,"merged":[]}
["EID","Roche CAP/CTM"]
[null,"Roche Amplicor"]
["Target # HEI","Abbott m2000"]
["Target # Tests"]
[]
[]
["# Samples received"]
["# Tests performed"]

{"sheet":"Forms","index":6,"n_rows":14,"n_cols":8,"rows_kept":14,"cut":false,"hidden":true,"merged":[]}
[]
[]
[]
[]
[]
[]
[]
[]
[]
[null,"Data to be collected"]
[]
[null,"CD4"]
[]
[null,"Lab","Analyzers","Consumption previous 4 quarters","Stock expiring later than initial forcasting quarter","Wastage (if not included in the consumption data)","Machine downtime (# days)","Stock Out (# days)"]

{"sheet":"Assumtpions and Data Source","index":7,"n_rows":3,"n_cols":2,"rows_kept":3,"cut":false,"hidden":true,"merged":[]}
[]
[]
[null,"Assumptions and data sources"]

{"sheet":"Excercises","index":8,"n_rows":55,"n_cols":6,"rows_kept":55,"cut":false,"hidden":true,"merged":[]}
[]
[]
["A: Complete no consumption"]
[null,"Procurement for Consumption in Quarter 1 (2014)","Procurement for Consumption in Quarter 2 (2014)","Procurement for consumption in Quarter 3 (2014)","Procurement for Consumption in Quarter 4 (2014)","Total Procurement"]
[]
["DBS Bundles - 20 Test Kits",302,235,248,260,1045]
["DBS Bundles - 50 Test Kits",0,0,0,0,0]
["Amplicor Reagent Kits",32,7,7,7,53]
["CAP/CTM Reagent Kits*",0,0,0,0,0]
["m2000 Reagent Kits*",52,27,27,27,133]
["Generic Lab Consumables Bundles Amplicor",4,1,1,1,7]
["Generic Lab Consumables Bundles CAP/CTM",0,0,0,0,0]
["Generic Lab Consumables Bundles Abbott",6,3,3,3,15]
[]
[]
[]
[]
[]
["B: No Min 1 DBS kit per site"]
[null,"Procurement for Consumption in Quarter 1 (2014)","Procurement for Consumption in Quarter 2 (2014)","Procurement for consumption in Quarter 3 (2014)","Procurement for Consumption in Quarter 4 (2014)","Total Procurement"]
[]
["DBS Bundles - 20 Test Kits",189,110,110,110,519]
["DBS Bundles - 50 Test Kits",0,0,0,0,0]
["Amplicor Reagent Kits",32,7,7,7,53]
["CAP/CTM Reagent Kits*",0,0,0,0,0]
["m2000 Reagent Kits*",52,27,27,27,133]
["Generic Lab Consumables Bundles Amplicor",4,1,1,1,7]
["Generic Lab Consumables Bundles CAP/CTM",0,0,0,0,0]
["Generic Lab Consumables Bundles Abbott",6,3,3,3,15]
[]
[]
["C: No wastage/Control/Training etc"]
[null,"Procurement for Consumption in Quarter 1 (2014)","Procurement for Consumption in Quarter 2 (2014)","Procurement for consumption in Quarter 3 (2014)","Procurement for Consumption in Quarter 4 (2014)","Total Procurement"]
[]
["DBS Bundles - 20 Test Kits",175,100,100,100,475]
["DBS Bundles - 50 Test Kits",0,0,0,0,0]
["Amplicor Reagent Kits",28,6,6,6,46]
["CAP/CTM Reagent Kits*",0,0,0,0,0]
["m2000 Reagent Kits*",45,23,23,23,114]
["Generic Lab Consumables Bundles Amplicor",4,1,1,1,7]
["Generic Lab Consumables Bundles CAP/CTM",0,0,0,0,0]
["Generic Lab Consumables Bundles Abbott",6,3,3,3,15]
[]
[]
["D: Consumption Data available"]
[null,"Procurement for Consumption in Quarter 1 (2014)","Procurement for Consumption in Quarter 2 (2014)","Procurement for consumption in Quarter 3 (2014)","Procurement for Consumption in Quarter 4 (2014)","Total Procurement"]
[]
["DBS Bundles - 20 Test Kits",133,79,80,82,374]
["DBS Bundles - 50 Test Kits",0,0,0,0,0]
["Amplicor Reagent Kits",30,11,12,11,64]
["CAP/CTM Reagent Kits*",0,0,0,0,0]
["m2000 Reagent Kits*",34,15,16,16,81]
["Generic Lab Consumables Bundles Amplicor",4,2,2,2,10]
["Generic Lab Consumables Bundles CAP/CTM",0,0,0,0,0]
["Generic Lab Consumables Bundles Abbott",4,2,2,2,10]